Benchmark failed to build: Determining projects to restore... /home/egorbo/bots/dotnet/sdk/10.0.100-preview.5.25277.114/Sdks/Microsoft.NET.Sdk/targets/Microsoft.NET.EolTargetFrameworks.targets(32,5): warning NETSDK1138: The target framework 'net7.0' is out of support and will not receive security updates in the future. Please refer to https://aka.ms/dotnet-core-support for more information about the support policy. [/tmp/sqqfxm1f.z3y/sqqfxm1f.z3y.csproj::TargetFramework=net7.0] Restored /tmp/sqqfxm1f.z3y/sqqfxm1f.z3y.csproj (in 833 ms). /home/egorbo/bots/dotnet/sdk/10.0.100-preview.5.25277.114/Sdks/Microsoft.NET.Sdk/targets/Microsoft.NET.RuntimeIdentifierInference.targets(326,5): message NETSDK1057: You are using a preview version of .NET. See: https://aka.ms/dotnet-support-policy [/tmp/sqqfxm1f.z3y/sqqfxm1f.z3y.csproj::TargetFramework=net10.0] /tmp/sqqfxm1f.z3y/Program.cs(3,14): error CS0260: Missing partial modifier on declaration of type 'Program'; another partial declaration of this type exists [/tmp/sqqfxm1f.z3y/sqqfxm1f.z3y.csproj::TargetFramework=net10.0] Build FAILED. /tmp/sqqfxm1f.z3y/Program.cs(3,14): error CS0260: Missing partial modifier on declaration of type 'Program'; another partial declaration of this type exists [/tmp/sqqfxm1f.z3y/sqqfxm1f.z3y.csproj::TargetFramework=net10.0] 0 Warning(s) 1 Error(s) Time Elapsed 00:00:04.27